Target
Serine/threonine-protein kinase pim-1
Ligand
BDBM182824
Substrate
Meas. Tech.
Trans-Phosphorylation Assay
pH
3±n/a
IC50
6±n/a nM
Comments
extracted
Citation
 Casuscelli, FCasale, EMontemartini, MPiutti, C Substituted 3,4-dihydropyrrolo[1,2-a]pyrazin-1(2H)-ones as protein kinase inhibitors US Patent  US9145418 Publication Date 9/29/2015 
Target
Name:
Serine/threonine-protein kinase pim-1
Synonyms:
PIM-1 Kinase PIM1_HUMAN Serine/threonine-protein kinase (PIM1) Serine/threonine-protein kinase PIM1 | Serine/threonine-protein kinase pim-1 (PIM1)
Type:
Protein
Mol. Mass.:
35681.82
Organism:
Homo sapiens (Human)
Description:
P11309
Residue:
313
  
Inhibitor
Name:
BDBM182824
Synonyms:
US9145418, 10
Type:
Small organic molecule
Emp. Form.:
C29H41FN6O2
Mol. Mass.:
524.6732
SMILES:
CN(C)C1CCN(C[C@@H](NC(=O)C[C@H]2CNC(=O)c3cc(cn23)-c2ccnc(F)c2)C2CCCCC2)CC1
: