Target
Epidermal growth factor receptor
Ligand
BDBM5439
Substrate
EGFR Substrate Peptide
Meas. Tech.
Kinase Inhibition Assay
pH
7.5±n/a
Temperature
296.15±n/a K
IC50
35±22 nM
Citation
 Zhang, YMCockerill, SGuntrip, SBRusnak, DSmith, KVanderwall, DWood, ELackey, K Synthesis and SAR of potent EGFR/erbB2 dual inhibitors. Bioorg Med Chem Lett 14:111-4 (2004)  
Target
Name:
Epidermal growth factor receptor
Synonyms:
EGF Receptor Substrate EGFR_HUMAN ERBB1 Epidermal Growth Factor Receptor erbB-1 Epidermal growth factor receptor (EGFR) HER1 Proto-oncogene c-ErbB-1 Tyrosine-Protein Kinase ErbB-1
Type:
Receptor Kinase Domain
Mol. Mass.:
134279.59
Organism:
Homo sapiens (Human)
Description:
P00533
Residue:
1210
  
Inhibitor
Name:
BDBM5439
Synonyms:
6-Thiazolylquinazoline 1 | N-(3-chloro-4-fluorophenyl)-6-(2-{[(2-methanesulfonylethyl)amino]methyl}-1,3-thiazol-4-yl)quinazolin-4-amine
Type:
Small organic molecule
Emp. Form.:
C21H19ClFN5O2S2
Mol. Mass.:
491.989
SMILES:
CS(=O)(=O)CCNCc1nc(cs1)-c1ccc2ncnc(Nc3ccc(F)c(Cl)c3)c2c1
:
Substrate
Name:
EGFR Substrate Peptide
Synonyms:
Type:
Peptide
Mol. Mass.:
3934.43
Organism:
Description:
10 uM ATP as co-substrate.
Residue:
34