Target
Receptor tyrosine-protein kinase erbB-2
Ligand
BDBM5439
Substrate
ErbB-2 Substrate Peptide
Meas. Tech.
Kinase Inhibition Assay
pH
7.5±n/a
Temperature
296.15±n/a K
IC50
200±110 nM
Citation
 Zhang, YMCockerill, SGuntrip, SBRusnak, DSmith, KVanderwall, DWood, ELackey, K Synthesis and SAR of potent EGFR/erbB2 dual inhibitors. Bioorg Med Chem Lett 14:111-4 (2004)  
Target
Name:
Receptor tyrosine-protein kinase erbB-2
Synonyms:
2.7.10.1 CD_antigen=CD340 ERBB2_HUMAN FASN/HER2 HER2 MLN19 NEU Proto-oncogene Neu Tyrosine kinase-type cell surface receptor HER2 | p185erbB2
Type:
Mol. Mass.:
137894.47
Organism:
Homo sapiens (Human)
Description:
P04626
Residue:
1255
  
Inhibitor
Name:
BDBM5439
Synonyms:
6-Thiazolylquinazoline 1 | N-(3-chloro-4-fluorophenyl)-6-(2-{[(2-methanesulfonylethyl)amino]methyl}-1,3-thiazol-4-yl)quinazolin-4-amine
Type:
Small organic molecule
Emp. Form.:
C21H19ClFN5O2S2
Mol. Mass.:
491.989
SMILES:
CS(=O)(=O)CCNCc1nc(cs1)-c1ccc2ncnc(Nc3ccc(F)c(Cl)c3)c2c1
:
Substrate
Name:
ErbB-2 Substrate Peptide
Synonyms:
Type:
Peptide
Mol. Mass.:
4131.76
Organism:
Description:
10 uM ATP as co-substrate.
Residue:
37