Target
Receptor tyrosine-protein kinase erbB-2
Ligand
BDBM5442
Substrate
ErbB-2 Substrate Peptide
Meas. Tech.
Kinase Inhibition Assay
pH
7.5±n/a
Temperature
296.15±n/a K
IC50
550±110 nM
Citation
 Zhang, YMCockerill, SGuntrip, SBRusnak, DSmith, KVanderwall, DWood, ELackey, K Synthesis and SAR of potent EGFR/erbB2 dual inhibitors. Bioorg Med Chem Lett 14:111-4 (2004)  
Target
Name:
Receptor tyrosine-protein kinase erbB-2
Synonyms:
2.7.10.1 CD_antigen=CD340 ERBB2_HUMAN FASN/HER2 HER2 MLN19 NEU Proto-oncogene Neu Tyrosine kinase-type cell surface receptor HER2 | p185erbB2
Type:
Mol. Mass.:
137894.47
Organism:
Homo sapiens (Human)
Description:
P04626
Residue:
1255
  
Inhibitor
Name:
BDBM5442
Synonyms:
6-(2-{[(2-methanesulfonylethyl)amino]methyl}-1,3-thiazol-4-yl)-N-(4-{[3-(trifluoromethyl)phenyl]methoxy}phenyl)quinazolin-4-amine | 6-Thiazolylquinazoline 4
Type:
Small organic molecule
Emp. Form.:
C29H26F3N5O3S2
Mol. Mass.:
613.674
SMILES:
CS(=O)(=O)CCNCc1nc(cs1)-c1ccc2ncnc(Nc3ccc(OCc4cccc(c4)C(F)(F)F)cc3)c2c1
:
Substrate
Name:
ErbB-2 Substrate Peptide
Synonyms:
Type:
Peptide
Mol. Mass.:
4131.76
Organism:
Description:
10 uM ATP as co-substrate.
Residue:
37