Target
Receptor tyrosine-protein kinase erbB-2
Ligand
BDBM5447
Substrate
ErbB-2 Substrate Peptide
Meas. Tech.
Kinase Inhibition Assay
pH
7.5±n/a
Temperature
296.15±n/a K
IC50
240±n/a nM
Citation
 Zhang, YMCockerill, SGuntrip, SBRusnak, DSmith, KVanderwall, DWood, ELackey, K Synthesis and SAR of potent EGFR/erbB2 dual inhibitors. Bioorg Med Chem Lett 14:111-4 (2004)  
Target
Name:
Receptor tyrosine-protein kinase erbB-2
Synonyms:
2.7.10.1 CD_antigen=CD340 ERBB2_HUMAN FASN/HER2 HER2 MLN19 NEU Proto-oncogene Neu Tyrosine kinase-type cell surface receptor HER2 | p185erbB2
Type:
Mol. Mass.:
137894.47
Organism:
Homo sapiens (Human)
Description:
P04626
Residue:
1255
  
Inhibitor
Name:
BDBM5447
Synonyms:
CHEMBL939 Iressa N-(3-chloro-4-fluorophenyl)-7-methoxy-6-[3-(morpholin-4-yl)propoxy]quinazolin-4-amine US10507209, Compound Gefitinib US9730934, Gefitinib WO2022090481, Example gefitinib cid_123631
Type:
Small organic molecule
Emp. Form.:
C22H24ClFN4O3
Mol. Mass.:
446.902
SMILES:
COc1cc2ncnc(Nc3ccc(F)c(Cl)c3)c2cc1OCCCN1CCOCC1
:
Substrate
Name:
ErbB-2 Substrate Peptide
Synonyms:
Type:
Peptide
Mol. Mass.:
4131.76
Organism:
Description:
10 uM ATP as co-substrate.
Residue:
37