Target
Dimer of Prostaglandin E2 receptor EP3 subtype
Ligand
BDBM184631
Substrate
Meas. Tech.
Radioligand Binding
pH
7.4±n/a
Temperature
277.15±n/a K
IC50
4700±n/a nM
Comments
extracted
Citation
 Donde, YNguyen, JHKedzie, KMGil, DWDonello, JEIm, W Treatment of inflammatory bowel disease US Patent  US9156810 Publication Date 10/13/2015 
Target
Name:
Dimer of Prostaglandin E2 receptor EP3 subtype
Synonyms:
hEP3D/ hEP3A
Type:
Protein
Mol. Mass.:
Description:
Components:
This complex has 2 components.
Component 1
Name:
Prostaglandin E2 receptor EP3 subtype
Synonyms:
PE2R3_HUMAN PGE2-R Prostaglandin E2 receptor Prostaglandin E2 receptor EP3 subtype (EP3) Prostaglandin E2 receptor EP3D subtype (EP3D) | Prostanoid EP3 receptor
Type:
Enzyme
Mol. Mass.:
43335.03
Organism:
Homo sapiens (Human)
Description:
P43115
Residue:
390
  
Component 2
Name:
Prostaglandin E2 receptor EP3 subtype
Synonyms:
PE2R3_HUMAN PGE2-R Prostaglandin E2 receptor Prostaglandin E2 receptor EP3 subtype (EP3) Prostaglandin E2 receptor EP3D subtype (EP3D) | Prostanoid EP3 receptor
Type:
Enzyme
Mol. Mass.:
43335.03
Organism:
Homo sapiens (Human)
Description:
P43115
Residue:
390
  
Inhibitor
Name:
BDBM184631
Synonyms:
US9156810, (54, 55)
Type:
Small organic molecule
Emp. Form.:
C26H32O5S
Mol. Mass.:
456.594
SMILES:
CC1(C)[C@@H](O)[C@H](\C=C\C(O)Cc2cc3ccccc3s2)[C@@H](C\C=C/CCCC(O)=O)C1=O
: