Target
Ferrochelatase, mitochondrial [R115L]
Ligand
BDBM5447
Substrate
Meas. Tech.
Competition Binding Assays
Kd
1.0e+3±n/a nM
Citation
 Klaeger, SGohlke, BPerrin, JGupta, VHeinzlmeir, SHelm, DQiao, HBergamini, GHanda, HSavitski, MMBantscheff, MMédard, GPreissner, RKuster, B Chemical Proteomics Reveals Ferrochelatase as a Common Off-target of Kinase Inhibitors. ACS Chem Biol 11:1245-54 (2016)  
Target
Name:
Ferrochelatase, mitochondrial [R115L]
Synonyms:
FECH HEMH_HUMAN
Type:
Protein
Mol. Mass.:
47832.73
Organism:
Homo sapiens (Human)
Description:
Mutant R115L used for experiment
Residue:
423
  
Inhibitor
Name:
BDBM5447
Synonyms:
CHEMBL939 Iressa N-(3-chloro-4-fluorophenyl)-7-methoxy-6-[3-(morpholin-4-yl)propoxy]quinazolin-4-amine US10507209, Compound Gefitinib US9730934, Gefitinib WO2022090481, Example gefitinib cid_123631
Type:
Small organic molecule
Emp. Form.:
C22H24ClFN4O3
Mol. Mass.:
446.902
SMILES:
COc1cc2ncnc(Nc3ccc(F)c(Cl)c3)c2cc1OCCCN1CCOCC1
: