Target
Ferrochelatase, mitochondrial [R115L]
Ligand
BDBM50161957
Substrate
Meas. Tech.
Competition Binding Assays
Kd
5.1e+3±n/a nM
Citation
 Klaeger, SGohlke, BPerrin, JGupta, VHeinzlmeir, SHelm, DQiao, HBergamini, GHanda, HSavitski, MMBantscheff, MMédard, GPreissner, RKuster, B Chemical Proteomics Reveals Ferrochelatase as a Common Off-target of Kinase Inhibitors. ACS Chem Biol 11:1245-54 (2016)  
Target
Name:
Ferrochelatase, mitochondrial [R115L]
Synonyms:
FECH HEMH_HUMAN
Type:
Protein
Mol. Mass.:
47832.73
Organism:
Homo sapiens (Human)
Description:
Mutant R115L used for experiment
Residue:
423
  
Inhibitor
Name:
BDBM50161957
Synonyms:
4-Dimethylamino-but-2-enoic acid {4-[3-chloro-4-(pyridin-2-ylmethoxy)-phenylamino]-3-cyano-7-ethoxy-quinolin-6-yl}-amide HKI-272 N-(4-(3-chloro-4-(pyridin-2-ylmethoxy)phenylamino)-3-cyano-7-ethoxyquinolin-6-yl)-4-(dimethylamino)butanamide US10822334, Compound Neratinib US20230382923, Compound Neratinib
Type:
Small organic molecule
Emp. Form.:
C30H29ClN6O3
Mol. Mass.:
557.043
SMILES:
CCOc1cc2ncc(C#N)c(Nc3ccc(OCc4ccccn4)c(Cl)c3)c2cc1NC(=O)\C=C\CN(C)C
: