Target
D(4) dopamine receptor
Ligand
BDBM50395587
Substrate
Meas. Tech.
Radioligand Binding Assay
pH
7.4±n/a
Ki
200±n/a nM
Comments
extracted
Citation
 Jin, JRoth, BFrye, S Functionally selective ligands of dopamine D2 receptors US Patent  US9156822 Publication Date 10/13/2015 
Target
Name:
D(4) dopamine receptor
Synonyms:
D(2C) dopamine receptor DOPAMINE D4.2 DRD4 Dopamine D4 receptor
Type:
Enzyme
Mol. Mass.:
48373.19
Organism:
Homo sapiens (Human)
Description:
P21917
Residue:
419
  
Inhibitor
Name:
BDBM50395587
Synonyms:
CHEMBL2165126 US9156822, 2
Type:
Small organic molecule
Emp. Form.:
C24H29Cl2N3O2
Mol. Mass.:
462.412
SMILES:
Clc1cccc(N2CCCN(CCCCOc3ccc4CCC(=O)Nc4c3)CC2)c1Cl
: