Target
Acetyl-CoA carboxylase 2
Ligand
BDBM186762
Substrate
Meas. Tech.
Spectrophotometric 384 Well Assay
pH
7.5±n/a
IC50
45±n/a nM
Comments
extracted
Citation
 Fleck, MHeine, NNosse, BRoth, GJHeimann, A Pyrrolidine derivatives, pharmaceutical compositions and uses thereof US Patent  US9169205 Publication Date 10/27/2015 
Target
Name:
Acetyl-CoA carboxylase 2
Synonyms:
ACACB ACC-beta ACCB Acetyl-CoA carboxylase 2 Acetyl-CoA carboxylase 2 (ACC2)
Type:
Protein
Mol. Mass.:
276535.21
Organism:
Homo sapiens (Human)
Description:
O00763
Residue:
2458
  
Inhibitor
Name:
BDBM186762
Synonyms:
US9169205, 2.54
Type:
Small organic molecule
Emp. Form.:
C34H38N4O5S
Mol. Mass.:
614.754
SMILES:
CCOc1ccc(cc1)N1CC[C@H](C1)Oc1ccc(cc1)[C@H](C)NC(=O)c1sc(NC(=O)COCc2ccccc2)nc1C
: