Target
Acetyl-CoA carboxylase 2
Ligand
BDBM186797
Substrate
Meas. Tech.
Spectrophotometric 384 Well Assay
pH
7.5±n/a
IC50
49±n/a nM
Comments
extracted
Citation
 Fleck, MHeine, NNosse, BRoth, GJHeimann, A Pyrrolidine derivatives, pharmaceutical compositions and uses thereof US Patent  US9169205 Publication Date 10/27/2015 
Target
Name:
Acetyl-CoA carboxylase 2
Synonyms:
ACACB ACC-beta ACCB Acetyl-CoA carboxylase 2 Acetyl-CoA carboxylase 2 (ACC2)
Type:
Protein
Mol. Mass.:
276535.21
Organism:
Homo sapiens (Human)
Description:
O00763
Residue:
2458
  
Inhibitor
Name:
BDBM186797
Synonyms:
US9169205, 5.1
Type:
Small organic molecule
Emp. Form.:
C24H30N2O4
Mol. Mass.:
410.506
SMILES:
COC(=O)N[C@@H](C)c1ccc(OC2CCN(C2)c2ccc(OCC3CC3)cc2)cc1
: