Target
D(4) dopamine receptor
Ligand
BDBM186926
Substrate
Meas. Tech.
Radioligand Binding Assay
pH
7.4±n/a
Ki
5526±n/a nM
Comments
extracted
Citation
 Besnard, JHopkins, ALGilbert, IRuda, GFAbecassis, K Morpholino compounds, uses and methods US Patent  US9079895 Publication Date 7/14/2015 
Target
Name:
D(4) dopamine receptor
Synonyms:
DRD4_MOUSE Drd4
Type:
Enzyme
Mol. Mass.:
41498.73
Organism:
Mus musculus (Mouse)
Description:
P51436
Residue:
387
  
Inhibitor
Name:
BDBM186926
Synonyms:
US9079895, 18s
Type:
Small organic molecule
Emp. Form.:
C21H24N2O3
Mol. Mass.:
352.4269
SMILES:
O=C(CN1CCO[C@H](COc2ccccc2)C1)N1CCc2ccccc12
: