Target
D(4) dopamine receptor
Ligand
BDBM186969
Substrate
Meas. Tech.
Radioligand Binding Assay
pH
7.4±n/a
Ki
3926±n/a nM
Comments
extracted
Citation
 Besnard, JHopkins, ALGilbert, IRuda, GFAbecassis, K Morpholino compounds, uses and methods US Patent  US9079895 Publication Date 7/14/2015 
Target
Name:
D(4) dopamine receptor
Synonyms:
DRD4_MOUSE Drd4
Type:
Enzyme
Mol. Mass.:
41498.73
Organism:
Mus musculus (Mouse)
Description:
P51436
Residue:
387
  
Inhibitor
Name:
BDBM186969
Synonyms:
US9079895, 32s
Type:
Small organic molecule
Emp. Form.:
C21H25FN2O2
Mol. Mass.:
356.4338
SMILES:
Fc1ccc(OC[C@@H]2CN(CCN3CCc4ccccc34)CCO2)cc1
: