Target
Fatty-acid amide hydrolase 1
Ligand
BDBM26741
Substrate
Meas. Tech.
Biological Assay
pH
9±n/a
IC50
19±n/a nM
Comments
extracted
Citation
 Apodaca, RBreitenbucher, JGPattabiraman, KSeierstad, MXiao, W Piperazinyl and piperidinyl ureas as modulators of fatty acid amide hydrolase US Patent  US9169224 Publication Date 10/27/2015 
Target
Name:
Fatty-acid amide hydrolase 1
Synonyms:
Anandamide amidohydrolase FAAH FAAH1_HUMAN Fatty-acid amide hydrolase (FAAH) Oleamide hydrolase 1
Type:
Protein
Mol. Mass.:
63071.19
Organism:
Homo sapiens (Human)
Description:
O00519
Residue:
579
  
Inhibitor
Name:
BDBM26741
Synonyms:
N-phenyl-4-(quinolin-2-ylmethyl)piperazine-1-carboxamide US9169224, 19
Type:
Small organic molecule
Emp. Form.:
C21H22N4O
Mol. Mass.:
346.4256
SMILES:
O=C(Nc1ccccc1)N1CCN(Cc2ccc3ccccc3n2)CC1
: