Target
Fatty-acid amide hydrolase 1
Ligand
BDBM188442
Substrate
Meas. Tech.
Biological Assay
pH
9±n/a
IC50
33±n/a nM
Comments
extracted
Citation
 Apodaca, RBreitenbucher, JGPattabiraman, KSeierstad, MXiao, W Piperazinyl and piperidinyl ureas as modulators of fatty acid amide hydrolase US Patent  US9169224 Publication Date 10/27/2015 
Target
Name:
Fatty-acid amide hydrolase 1
Synonyms:
Anandamide amidohydrolase FAAH FAAH1_HUMAN Fatty-acid amide hydrolase (FAAH) Oleamide hydrolase 1
Type:
Protein
Mol. Mass.:
63071.19
Organism:
Homo sapiens (Human)
Description:
O00519
Residue:
579
  
Inhibitor
Name:
BDBM188442
Synonyms:
US9169224, 131
Type:
Small organic molecule
Emp. Form.:
C28H27N3O2
Mol. Mass.:
437.5329
SMILES:
O=C(Nc1ccccc1)N1CCN(Cc2cccc(Oc3ccc4ccccc4c3)c2)CC1
: