Target
Fatty-acid amide hydrolase 1
Ligand
BDBM188341
Substrate
Meas. Tech.
Biological Assay
pH
9±n/a
IC50
38±n/a nM
Comments
extracted
Citation
 Apodaca, RBreitenbucher, JGPattabiraman, KSeierstad, MXiao, W Piperazinyl and piperidinyl ureas as modulators of fatty acid amide hydrolase US Patent  US9169224 Publication Date 10/27/2015 
Target
Name:
Fatty-acid amide hydrolase 1
Synonyms:
Anandamide amidohydrolase FAAH FAAH1_HUMAN Fatty-acid amide hydrolase (FAAH) Oleamide hydrolase 1
Type:
Protein
Mol. Mass.:
63071.19
Organism:
Homo sapiens (Human)
Description:
O00519
Residue:
579
  
Inhibitor
Name:
BDBM188341
Synonyms:
US9169224, 162 | US9169224, 21
Type:
Small organic molecule
Emp. Form.:
C18H19Br2N3O
Mol. Mass.:
453.171
SMILES:
Brc1ccc(CN2CCN(CC2)C(=O)Nc2ccccc2)cc1Br
: