Target
Fatty-acid amide hydrolase 1
Ligand
BDBM188375
Substrate
Meas. Tech.
FAAH Assay
pH
9±n/a
IC50
16±n/a nM
Comments
extracted
Citation
 Apodaca, RBreitenbucher, JGPattabiraman, KSeierstad, MXiao, W Piperazinyl and piperidinyl ureas as modulators of fatty acid amide hydrolase US Patent  US9169224 Publication Date 10/27/2015 
Target
Name:
Fatty-acid amide hydrolase 1
Synonyms:
Anandamide amidohydrolase FAAH FAAH1_HUMAN Fatty-acid amide hydrolase (FAAH) Oleamide hydrolase 1
Type:
Protein
Mol. Mass.:
63071.19
Organism:
Homo sapiens (Human)
Description:
O00519
Residue:
579
  
Inhibitor
Name:
BDBM188375
Synonyms:
US9169224, 59
Type:
Small organic molecule
Emp. Form.:
C22H23N3O2
Mol. Mass.:
361.4369
SMILES:
Oc1c(CN2CCN(CC2)C(=O)Nc2ccccc2)ccc2ccccc12
: