Target
Methionine aminopeptidase 2
Ligand
BDBM188717
Substrate
Meas. Tech.
Enzymatic Screening Assay
IC50
34.5±n/a nM
Citation
 Benazet, ADuclos, OGuillo, NLassalle, GMacary, KVin, V Pyrazoloquinolinone derivatives, preparation thereof and therapeutic use thereof US Patent  US9169246 Publication Date 10/27/2015 
Target
Name:
Methionine aminopeptidase 2
Synonyms:
Initiation factor 2-associated 67 kDa glycoprotein MAP2_HUMAN MNPEP Methionine aminopeptidase 2 (MetAP2) P67EIF2 p67
Type:
Enzyme
Mol. Mass.:
52884.45
Organism:
Homo sapiens (Human)
Description:
P50579
Residue:
478
  
Inhibitor
Name:
BDBM188717
Synonyms:
US9169246, 259
Type:
Small organic molecule
Emp. Form.:
C23H22F3N5O2
Mol. Mass.:
457.4483
SMILES:
CC1CN(CC(C)O1)c1ncccc1-c1ccc2c3n[nH]cc3c(=O)n(CC(F)(F)F)c2c1
: