Target
Serine/threonine-protein kinase Sgk1
Ligand
BDBM50043921
Substrate
Meas. Tech.
Enzymatic Activity Assay
IC50
15±n/a nM
Citation
 Nazare, MHalland, NSchmidt, FWeiss, TDietz, UHofmeister, A N-[4-(1H-pyrazolo[3,4-b]pyrazin-6-yl)-phenyl]-sulfonamides and their use as pharmaceuticals US Patent  US9174993 Publication Date 11/3/2015 
Target
Name:
Serine/threonine-protein kinase Sgk1
Synonyms:
SGK SGK1_HUMAN Serine/threonine-protein kinase Sgk1 (SGK) Serum/glucocorticoid-regulated kinase 1 (SGK1)
Type:
Other Protein Type
Mol. Mass.:
48954.40
Organism:
Homo sapiens (Human)
Description:
Recombinant human SGK-1 enzyme produced in a baculovirus system.
Residue:
431
  
Inhibitor
Name:
BDBM50043921
Synonyms:
CHEMBL3356047 | US9174993, 58
Type:
Small organic molecule
Emp. Form.:
C17H12F2N6O2S
Mol. Mass.:
402.378
SMILES:
Nc1n[nH]c2nc(cnc12)-c1ccc(NS(=O)(=O)c2cc(F)ccc2F)cc1
: