Target
Histone-lysine N-methyltransferase EZH2 [Y641F]
Ligand
BDBM172174
Substrate
Meas. Tech.
Inhibition Assay
IC50
1.5±n/a nM
Citation
 Kuntz, KWKnutson, SKWigle, TJ Inhibitors of human EZH2, and methods of use thereof US Patent  US9175331 Publication Date 11/3/2015 
Target
Name:
Histone-lysine N-methyltransferase EZH2 [Y641F]
Synonyms:
EZH2 EZH2_HUMAN KMT6
Type:
Mol. Mass.:
85351.84
Organism:
Homo sapiens (Human)
Description:
Q15910[Y641F]
Residue:
746
  
Inhibitor
Name:
BDBM172174
Synonyms:
EPZ008681 US11052093, Compound 182 US9175331, 44
Type:
Small organic molecule
Emp. Form.:
C36H49N5O4
Mol. Mass.:
615.8054
SMILES:
CCN([C@H]1CC[C@@H](CC1)N(C)C)c1cc(cc(C(=O)NCc2c(C)cc(C)[nH]c2=O)c1C)-c1ccc(cc1)C(=O)NCCCO
: