Target
Histone-lysine N-methyltransferase EZH2 [Y641F]
Ligand
BDBM190223
Substrate
Meas. Tech.
Inhibition Assay
IC50
1.6±n/a nM
Citation
 Kuntz, KWKnutson, SKWigle, TJ Inhibitors of human EZH2, and methods of use thereof US Patent  US9175331 Publication Date 11/3/2015 
Target
Name:
Histone-lysine N-methyltransferase EZH2 [Y641F]
Synonyms:
EZH2 EZH2_HUMAN KMT6
Type:
Mol. Mass.:
85351.84
Organism:
Homo sapiens (Human)
Description:
Q15910[Y641F]
Residue:
746
  
Inhibitor
Name:
BDBM190223
Synonyms:
EPZ009158 | US9175331, 60
Type:
Small organic molecule
Emp. Form.:
C25H34ClN3O3
Mol. Mass.:
460.009
SMILES:
CCN(C1CCC(CO)CC1)c1cc(Cl)cc(C(=O)NCc2c(C)cc(C)[nH]c2=O)c1C
: