Target
Serine/threonine-protein kinase PLK1
Ligand
BDBM190266
Substrate
Meas. Tech.
Fluorescent Polarization Binding Assay
pH
8±n/a
Temperature
298.15±n/a K
IC50
16500±n/a nM
Comments
extracted
Citation
 McInnes, CFarag, DB Fragment ligated inhibitors selective for the polo box domain of PLK1 US Patent  US9175357 Publication Date 11/3/2015 
Target
Name:
Serine/threonine-protein kinase PLK1
Synonyms:
PLK PLK1 Polo-like kinase 1 (PlK1) STPK13 Serine/threonine-protein kinase 13 | polo-like kinase
Type:
Serine/threonine-protein kinase
Mol. Mass.:
68277.16
Organism:
Homo sapiens (Human)
Description:
P53350
Residue:
603
  
Inhibitor
Name:
BDBM190266
Synonyms:
US9175357, 5830
Type:
Small organic molecule
Emp. Form.:
C11H16N2O
Mol. Mass.:
192.2575
SMILES:
CCCNc1ccc(cc1)C(=O)NC
: