Target
Vasopressin V1a receptor
Ligand
BDBM288712
Substrate
Meas. Tech.
competition binding assay
Temperature
298.15±n/a K
Ki
1.000±n/a nM
Comments
extracted
Citation
 Dolente, CFasching, BRuntz-Schmitt, VSchnider, P Spiro-thiazolones US Patent  US10092551 Publication Date 10/9/2018 
Target
Name:
Vasopressin V1a receptor
Synonyms:
AVPR V1a AVPR1A V1AR_HUMAN VASOPRESSIN V1A Vasopressin V1 receptor Vasopressin receptor
Type:
Receptor
Mol. Mass.:
46820.18
Organism:
Homo sapiens (Human)
Description:
P37288
Residue:
418
  
Inhibitor
Name:
BDBM288712
Synonyms:
US10092551, Example 20
Type:
Small organic molecule
Emp. Form.:
C25H23ClN2O2S
Mol. Mass.:
450.98
SMILES:
Clc1ccc2CCC\C(=C3\SC(=NC3=O)N3CCC4(CC3)OCc3ccccc43)c2c1
: