Target
Vasopressin V1a receptor
Ligand
BDBM288729
Substrate
Meas. Tech.
competition binding assay
Temperature
298.15±n/a K
Ki
0.794±n/a nM
Comments
extracted
Citation
 Dolente, CFasching, BRuntz-Schmitt, VSchnider, P Spiro-thiazolones US Patent  US10092551 Publication Date 10/9/2018 
Target
Name:
Vasopressin V1a receptor
Synonyms:
AVPR V1a AVPR1A V1AR_HUMAN VASOPRESSIN V1A Vasopressin V1 receptor Vasopressin receptor
Type:
Receptor
Mol. Mass.:
46820.18
Organism:
Homo sapiens (Human)
Description:
P37288
Residue:
418
  
Inhibitor
Name:
BDBM288729
Synonyms:
US10092551, Example 37
Type:
Small organic molecule
Emp. Form.:
C22H23N3O2S
Mol. Mass.:
393.502
SMILES:
C\C(=C1\SC(=NC1=O)N1CCC2(CC1)OCc1ccccc21)c1cccn1C
: