Target
Lysine-specific demethylase 5D [1-760]
Ligand
BDBM191598
Substrate
Meas. Tech.
Formaldehyde Dehydrogenase-Coupled Demethylase (FDH) Assay
Temperature
298.15±n/a K
IC50
1.4e+4± 4e+3 nM
Comments
extracted
Citation
 Horton, JRLiu, XGale, MWu, LShanks, JRZhang, XWebber, PJBell, JSKales, SCMott, BTRai, GJansen, DJHenderson, MJUrban, DJHall, MDSimeonov, AMaloney, DJJohns, MAFu, HJadhav, AVertino, PMYan, QCheng, X Structural Basis for KDM5A Histone Lysine Demethylase Inhibition by Diverse Compounds. Cell Chem Biol 23:769-81 (2016)  
Target
Name:
Lysine-specific demethylase 5D [1-760]
Synonyms:
HY JARID1D KDM5D_HUMAN Lysine-specific demethylase 5D (KDM5D(aa 1-760)-AP) | SMCY
Type:
Protein
Mol. Mass.:
87351.60
Organism:
Homo sapiens (Human)
Description:
Truncation 1-760 aa. Contains deletion of ARID and PhD1 domains.
Residue:
760
  
Inhibitor
Name:
BDBM191598
Synonyms:
2-(((2-((2-(dimethylamino)ethyl)(ethyl)amino)-2-oxoethyl)amino)methyl)isonicotinic acid (KDM5-C49) KDOAM-20
Type:
Small organic molecule
Emp. Form.:
C15H24N4O3
Mol. Mass.:
308.3761
SMILES:
CCN(CCN(C)C)C(=O)CNCc1cc(ccn1)C(O)=O
: