Target
Lysine-specific demethylase 5A [1-588]
Ligand
BDBM191602
Substrate
Meas. Tech.
Isothermal Titration Calorimetry (ITC)
Kd
4.5e+2± 3e+1 nM
Citation
 Horton, JRLiu, XGale, MWu, LShanks, JRZhang, XWebber, PJBell, JSKales, SCMott, BTRai, GJansen, DJHenderson, MJUrban, DJHall, MDSimeonov, AMaloney, DJJohns, MAFu, HJadhav, AVertino, PMYan, QCheng, X Structural Basis for KDM5A Histone Lysine Demethylase Inhibition by Diverse Compounds. Cell Chem Biol 23:769-81 (2016)  
Target
Name:
Lysine-specific demethylase 5A [1-588]
Synonyms:
JARID1A KDM5A_HUMAN RBBP2 | RBP2
Type:
Protein
Mol. Mass.:
66955.44
Organism:
Homo sapiens (Human)
Description:
Truncation 1-588 aa. Contains deletion of ARID and PhD1 domains.
Residue:
588
  
Inhibitor
Name:
BDBM191602
Synonyms:
3-((1-methyl-1Hpyrrolo[2,3-b]pyridin-3-yl)amino)isonicotinic acid (N12) US10336727, Example 52 | US9617242, Example 52
Type:
Small organic molecule
Emp. Form.:
C14H12N4O2
Mol. Mass.:
268.2707
SMILES:
Cn1cc(Nc2cnccc2C(O)=O)c2cccnc12
: