Target
Lysine-specific demethylase 5C
Ligand
BDBM191598
Substrate
Meas. Tech.
AlphaLISA Assay
pH
7.2±n/a
Temperature
298.15±n/a K
IC50
59± 4 nM
Comments
extracted
Citation
 Horton, JRLiu, XGale, MWu, LShanks, JRZhang, XWebber, PJBell, JSKales, SCMott, BTRai, GJansen, DJHenderson, MJUrban, DJHall, MDSimeonov, AMaloney, DJJohns, MAFu, HJadhav, AVertino, PMYan, QCheng, X Structural Basis for KDM5A Histone Lysine Demethylase Inhibition by Diverse Compounds. Cell Chem Biol 23:769-81 (2016)  
Target
Name:
Lysine-specific demethylase 5C
Synonyms:
DXS1272E JARID1C KDM5C Lysine-specific demethylase 5C (KDM5C) Protein SmcX SMCX | XE169
Type:
PROTEIN
Mol. Mass.:
175691.17
Organism:
Homo sapiens (Human)
Description:
P41229
Residue:
1560
  
Inhibitor
Name:
BDBM191598
Synonyms:
2-(((2-((2-(dimethylamino)ethyl)(ethyl)amino)-2-oxoethyl)amino)methyl)isonicotinic acid (KDM5-C49) KDOAM-20
Type:
Small organic molecule
Emp. Form.:
C15H24N4O3
Mol. Mass.:
308.3761
SMILES:
CCN(CCN(C)C)C(=O)CNCc1cc(ccn1)C(O)=O
: