Target
Tyrosine-protein kinase Tec
Ligand
BDBM97672
Substrate
Meas. Tech.
HotSpot kinase assay
IC50
108±n/a nM
Citation
 Honigberg, LVerner, EBuggy, JJLoury, DChen, W Inhibitors of bruton's tyrosine kinase US Patent  US9181263 Publication Date 11/10/2015 
Target
Name:
Tyrosine-protein kinase Tec
Synonyms:
PSCTK4 TEC_HUMAN | Tyrosine-protein kinase TEC (TEC)
Type:
Protein
Mol. Mass.:
73597.00
Organism:
Homo sapiens (Human)
Description:
Residue:
631
  
Inhibitor
Name:
BDBM97672
Synonyms:
US8476284, 40 US9181263, 9 | US9278100, 9
Type:
Small organic molecule
Emp. Form.:
C26H26N6O2
Mol. Mass.:
454.5236
SMILES:
Nc1ncnc2n(nc(-c3ccc(Oc4ccccc4)cc3)c12)[C@@H]1CC[C@@H](CC1)NC(=O)C=C
: