Target
Serine protease hepsin
Ligand
BDBM191635
Substrate
Meas. Tech.
High-Throughput Screening Assay
IC50
720±200 nM
Citation
 Vasioukhin, VIChevillet, JR Hepsin inhibitors US Patent  US9182402 Publication Date 11/10/2015 
Target
Name:
Serine protease hepsin
Synonyms:
HEPS_HUMAN Hepsin TMPRSS1 Transmembrane protease, serine 1
Type:
Enzyme
Mol. Mass.:
45016.98
Organism:
Homo sapiens (Human)
Description:
Human deglycosylated hepsin was expressed in Pichia pastoris.
Residue:
417
  
Inhibitor
Name:
BDBM191635
Synonyms:
US9182402, 8
Type:
Small organic molecule
Emp. Form.:
C15H9BrCl2N4OS
Mol. Mass.:
444.133
SMILES:
Clc1ccc(NC(=O)Nc2nnc(s2)-c2ccc(Br)cc2)cc1Cl
: