Target
Carbonic anhydrase 2
Ligand
BDBM193786
Substrate
Meas. Tech.
Carbonic Anhydrase (bCAII) Inhibition Assay
pH
7.2±n/a
IC50
5.812e+4± 5.2e+2 nM
Comments
extracted
Citation
 Imran, STaha, MIsmail, NHFayyaz, SKhan, KMChoudhary, MI Synthesis of novel bisindolylmethanes: New carbonic anhydrase II inhibitors, docking, and 3D pharmacophore studies. Bioorg Chem 68:90-104 (2016)  
Target
Name:
Carbonic anhydrase 2
Synonyms:
CA2 Carbonic anhydrase Carbonic anhydrase II Carbonic anhydrase II (CA-II)
Type:
Enzyme Catalytic Domain
Mol. Mass.:
29115.93
Organism:
Bos taurus
Description:
Residue:
260
  
Inhibitor
Name:
BDBM193786
Synonyms:
3,5-Dichloro-N-(4-(di(1H-indol-3-yl)methyl)phenyl)-2-hydroxybenzenesulfonamide (3k)
Type:
Small organic molecule
Emp. Form.:
C29H21Cl2N3O3S
Mol. Mass.:
562.466
SMILES:
Oc1c(Cl)cc(Cl)cc1S(=O)(=O)Nc1ccc(cc1)C(c1c[nH]c2ccccc12)c1c[nH]c2ccccc12
: