Target
Carbonic anhydrase 2
Ligand
BDBM193794
Substrate
Meas. Tech.
Carbonic Anhydrase (bCAII) Inhibition Assay
pH
7.2±n/a
IC50
6.516e+4± 1.3e+3 nM
Comments
extracted
Citation
 Imran, STaha, MIsmail, NHFayyaz, SKhan, KMChoudhary, MI Synthesis of novel bisindolylmethanes: New carbonic anhydrase II inhibitors, docking, and 3D pharmacophore studies. Bioorg Chem 68:90-104 (2016)  
Target
Name:
Carbonic anhydrase 2
Synonyms:
CA2 Carbonic anhydrase Carbonic anhydrase II Carbonic anhydrase II (CA-II)
Type:
Enzyme Catalytic Domain
Mol. Mass.:
29115.93
Organism:
Bos taurus
Description:
Residue:
260
  
Inhibitor
Name:
BDBM193794
Synonyms:
N-(4-(bis(5-bromo-1H-indol-3-yl)methyl)phenyl)-2-nitrobenzenesulfonamide (4d)
Type:
Small organic molecule
Emp. Form.:
C29H20Br2N4O4S
Mol. Mass.:
680.367
SMILES:
[O-][N+](=O)c1ccccc1S(=O)(=O)Nc1ccc(cc1)C(c1c[nH]c2ccc(Br)cc12)c1c[nH]c2ccc(Br)cc12
: