Target
Aldo-keto reductase family 1 member A1
Ligand
BDBM193868
Substrate
Meas. Tech.
ALR1 in vitro Inhibition Assay
pH
6.2±n/a
IC50
5.68e+3± 1.04e+3 nM
Comments
extracted
Citation
 Ibrar, ATehseen, YKhan, IHameed, ASaeed, AFurtmann, NBajorath, JIqbal, J Coumarin-thiazole and -oxadiazole derivatives: Synthesis, bioactivity and docking studies for aldose/aldehyde reductase inhibitors. Bioorg Chem 68:177-186 (2016)  
Target
Name:
Aldo-keto reductase family 1 member A1
Synonyms:
AK1A1_BOVIN Aldehyde reductase (ALR1)
Type:
Protein
Mol. Mass.:
36620.67
Organism:
Bos taurus (Cattle)
Description:
Residue:
325
  
Inhibitor
Name:
BDBM193868
Synonyms:
3-(4-((4-Chlorophenylamino)methyl)-5-thioxo-4,5-dihydro-1,3,4-oxadiazol-2-yl)-2H-chromen-2-one (11f)
Type:
Small organic molecule
Emp. Form.:
C18H12ClN3O3S
Mol. Mass.:
385.824
SMILES:
Clc1ccc(NCn2nc(oc2=S)-c2cc3ccccc3oc2=O)cc1
: