Target
Dual specificity protein kinase TTK
Ligand
BDBM194279
Substrate
Meas. Tech.
Mps-1 Kinase Assay
pH
7.7±n/a
Temperature
295.15±n/a K
IC50
17±n/a nM
Comments
extracted
Citation
 Klar, UKoppitz, MJautelat, RKosemund, DBohlmann, RBader, BLienau, PSiemeister, GScott, W Substituted imidazopyrazines US Patent  US9199999 Publication Date 12/1/2015 
Target
Name:
Dual specificity protein kinase TTK
Synonyms:
Dual specificity protein kinase (TTK) MPS1 Monopolar Spindle 1 (MPS1) Monopolar Spindle 1 Kinase (MPS1) TTK | TTK_HUMAN
Type:
Protein
Mol. Mass.:
97086.79
Organism:
Homo sapiens (Human)
Description:
P33981
Residue:
857
  
Inhibitor
Name:
BDBM194279
Synonyms:
US9199999, 17
Type:
Small organic molecule
Emp. Form.:
C24H27N5O2
Mol. Mass.:
417.5035
SMILES:
COCC#Cc1cn2c(cnc2c(NCC(C)C)n1)-c1ccc(cc1)C(=O)NC1CC1
: