Target
Dual specificity protein kinase TTK
Ligand
BDBM194229
Substrate
Meas. Tech.
Mps-1 Kinase Assay
pH
7.7±n/a
Temperature
295.15±n/a K
IC50
7.1±n/a nM
Comments
extracted
Citation
 Klar, UKoppitz, MJautelat, RKosemund, DBohlmann, RBader, BLienau, PSiemeister, GScott, W Substituted imidazopyrazines US Patent  US9199999 Publication Date 12/1/2015 
Target
Name:
Dual specificity protein kinase TTK
Synonyms:
Dual specificity protein kinase (TTK) MPS1 Monopolar Spindle 1 (MPS1) Monopolar Spindle 1 Kinase (MPS1) TTK | TTK_HUMAN
Type:
Protein
Mol. Mass.:
97086.79
Organism:
Homo sapiens (Human)
Description:
P33981
Residue:
857
  
Inhibitor
Name:
BDBM194229
Synonyms:
US9199999, 57
Type:
Small organic molecule
Emp. Form.:
C24H21F3N6O
Mol. Mass.:
466.4583
SMILES:
OCC#Cc1cn2c(cnc2c(NCCC(F)(F)F)n1)-c1ccc(cc1)-c1cnc([nH]1)C1CC1
: