Target
Hypoxanthine phosphoribosyltransferase
Ligand
BDBM60884
Substrate
Meas. Tech.
Growth Inhibition Assay
Temperature
310.15±n/a K
Ki
>250000±n/a nM
Comments
extracted
Citation
 De Jersey, JGuddat, LWHockova, DKeough, DT 6-oxopurine phosphoribosyltransferase inhibitors US Patent  US9200020 Publication Date 12/1/2015 
Target
Name:
Hypoxanthine phosphoribosyltransferase
Synonyms:
Hypoxanthine-guanine phosphoribosyltransferase (HGPRT)
Type:
Enzyme
Mol. Mass.:
26972.31
Organism:
Plasmodium vivax
Description:
A0A0J9TE27
Residue:
233
  
Inhibitor
Name:
BDBM60884
Synonyms:
US9200020, Table 1, Compound 2B
Type:
Emp. Form.:
C9H15N5O4P
Mol. Mass.:
288.2203
SMILES:
OP(O)(=O)CCNCCn1c[nH]c2c1nc[nH]c2=O
: