Target
Hypoxanthine phosphoribosyltransferase
Ligand
BDBM60886
Substrate
Meas. Tech.
Growth Inhibition Assay
Temperature
310.15±n/a K
Ki
11000±1000 nM
Comments
extracted
Citation
 De Jersey, JGuddat, LWHockova, DKeough, DT 6-oxopurine phosphoribosyltransferase inhibitors US Patent  US9200020 Publication Date 12/1/2015 
Target
Name:
Hypoxanthine phosphoribosyltransferase
Synonyms:
Hypoxanthine-guanine phosphoribosyltransferase (HGPRT)
Type:
Enzyme
Mol. Mass.:
26972.31
Organism:
Plasmodium vivax
Description:
A0A0J9TE27
Residue:
233
  
Inhibitor
Name:
BDBM60886
Synonyms:
US9200020, Table 3, Compound 1B
Type:
Emp. Form.:
C13H21N5O6P
Mol. Mass.:
374.3095
SMILES:
CCOC(=O)CN(CCn1c[nH]c2c1nc[nH]c2=O)CCP(O)(O)=O
: