Target
Tyrosine-protein kinase transforming protein Src [144-247,E177Q,S178L,E179A,T180R,T181V,C186A,K201L]
Ligand
BDBM195583
Substrate
Meas. Tech.
Fluorescence Polarization Assay
pH
7.35±n/a
Kd
7.7±0.6 nM
Comments
extracted
Citation
 Ju, TNiu, WGuo, J Evolution of Src Homology 2 (SH2) Domain to Recognize Sulfotyrosine. ACS Chem Biol 11:2551-7 (2016)  
Target
Name:
Tyrosine-protein kinase transforming protein Src [144-247,E177Q,S178L,E179A,T180R,T181V,C186A,K201L]
Synonyms:
SRC_RSVSE Src homology 2 domain mutant (SH2-58.6) | V-SRC
Type:
Protein
Mol. Mass.:
11932.98
Organism:
Rous sarcoma virus (Virus)
Description:
P63185[144-247,E177Q,S178L,E179A,T180R,T181V,C186A,K201L]
Residue:
104
  
Inhibitor
Name:
BDBM195583
Synonyms:
Phosphotyrosine (pTyr)
Type:
Small organic molecule
Emp. Form.:
C9H10NO6P
Mol. Mass.:
259.1537
SMILES:
[NH3+][C@@H](Cc1ccc(OP([O-])([O-])=O)cc1)C([O-])=O
: