Target
Prostaglandin D2 receptor 2
Ligand
BDBM196943
Substrate
Meas. Tech.
Radioligand Binding Assay
pH
7.4±n/a
Ki
0.3±n/a nM
Comments
extracted
Citation
 Martyres, DAnderskewitz, RHoenke, CKriegl, JOost, TRist, WSeither, P Pyrazole compounds as CRTH2 antagonists US Patent  US9206164 Publication Date 12/8/2015 
Target
Name:
Prostaglandin D2 receptor 2
Synonyms:
CD_antigen=CD294 Chemoattractant Receptor-homologous molecule expressed on T-helper type 2 cells (CRTH2) Chemoattractant receptor-homologous molecule expressed on Th2 cells (CRTH2) G protein-coupled receptor 44 GPR44 PTGDR2 Prostaglandin D2 receptor 2 | Prostaglandin D2 receptor 2 (PGD2)
Type:
Enzyme
Mol. Mass.:
43295.45
Organism:
Homo sapiens (Human)
Description:
Q9Y5Y4
Residue:
395
  
Inhibitor
Name:
BDBM196943
Synonyms:
US9206164, 4
Type:
Small organic molecule
Emp. Form.:
C23H20F3N3O2
Mol. Mass.:
427.419
SMILES:
Cc1nn(Cc2ccc(cc2)-c2cc3ccc(cc3[nH]2)C(F)(F)F)c(C)c1CC(O)=O
: