Target
Prostaglandin D2 receptor 2
Ligand
BDBM197024
Substrate
Meas. Tech.
Radioligand Binding Assay
pH
7.4±n/a
Ki
0.1±n/a nM
Comments
extracted
Citation
 Martyres, DAnderskewitz, RHoenke, CKriegl, JOost, TRist, WSeither, P Pyrazole compounds as CRTH2 antagonists US Patent  US9206164 Publication Date 12/8/2015 
Target
Name:
Prostaglandin D2 receptor 2
Synonyms:
CD_antigen=CD294 Chemoattractant Receptor-homologous molecule expressed on T-helper type 2 cells (CRTH2) Chemoattractant receptor-homologous molecule expressed on Th2 cells (CRTH2) G protein-coupled receptor 44 GPR44 PTGDR2 Prostaglandin D2 receptor 2 | Prostaglandin D2 receptor 2 (PGD2)
Type:
Enzyme
Mol. Mass.:
43295.45
Organism:
Homo sapiens (Human)
Description:
Q9Y5Y4
Residue:
395
  
Inhibitor
Name:
BDBM197024
Synonyms:
US9206164, 88 | US9206164, 98
Type:
Small organic molecule
Emp. Form.:
C27H31FN4O2
Mol. Mass.:
462.559
SMILES:
CCc1nn(Cc2ccc(cc2F)-c2nc3cc(ccc3[nH]2)C(C)(C)C)c(CC)c1CC(O)=O
: