Target
Leucine-rich repeat serine/threonine-protein kinase 2
Ligand
BDBM196742
Substrate
Meas. Tech.
Lanthascreen Binding Assay
Ki
0.96±n/a nM
Citation
 Baker-Glenn, CBurdick, DJChan, BKChambers, MChen, HEstrada, ASweeney, ZK Pyrazole aminopyrimidine derivatives as LRRK2 modulators US Patent  US9212173 Publication Date 12/15/2015 
Target
Name:
Leucine-rich repeat serine/threonine-protein kinase 2
Synonyms:
Dardarin LRRK2_HUMAN Leucine-rich repeat serine/threonine-protein kinase 2 PARK8
Type:
Protein
Mol. Mass.:
286113.20
Organism:
Homo sapiens (Human)
Description:
Q5S007
Residue:
2527
  
Inhibitor
Name:
BDBM196742
Synonyms:
US9212173, 20
Type:
Small organic molecule
Emp. Form.:
C14H19F3N6O3S
Mol. Mass.:
408.399
SMILES:
CCNc1nc(Nc2cn(nc2C)S(=O)(=O)CCOC)ncc1C(F)(F)F
: