Target
Cyclin-dependent kinase 2/G1/S-specific cyclin-E1
Ligand
BDBM5659
Substrate
GST-Rb fusion protein
Meas. Tech.
Kinase Inhibition assay
IC50
6±n/a nM
Citation
 Kim, KSKimball, SDMisra, RNRawlins, DBHunt, JTXiao, HYLu, SQian, LHan, WCShan, WMitt, TCai, ZWPoss, MAZhu, HSack, JSTokarski, JSChang, CYPavletich, NKamath, AHumphreys, WGMarathe, PBursuker, IKellar, KARoongta, UBatorsky, RMulheron, JGBol, DFairchild, CRLee, FYWebster, KR Discovery of aminothiazole inhibitors of cyclin-dependent kinase 2: synthesis, X-ray crystallographic analysis, and biological activities. J Med Chem 45:3905-27 (2002)  
Target
Name:
Cyclin-dependent kinase 2/G1/S-specific cyclin-E1
Synonyms:
CDK2/CycE CDK2/E Cyclin-Dependent Kinase 2 (CDK2) Cyclin-dependent kinase 2/cyclin E1
Type:
Protein
Mol. Mass.:
Description:
Components:
This complex has 2 components.
Component 1
Name:
Cyclin-dependent kinase 2
Synonyms:
CDK2 CDK2_HUMAN Cell division protein kinase 2 Protein cereblon/Cyclin-dependent kinase 2 | p33 protein kinase
Type:
Enzyme Subunit
Mol. Mass.:
33938.17
Organism:
Homo sapiens (Human)
Description:
P24941
Residue:
298
  
Component 2
Name:
G1/S-specific cyclin-E1
Synonyms:
CCNE CCNE1_HUMAN
Type:
Enzyme Subunit
Mol. Mass.:
47073.17
Organism:
Homo sapiens (Human)
Description:
Residue:
410
  
Inhibitor
Name:
BDBM5659
Synonyms:
2-amino-5-thio-substituted thiazole 24 N-[5-[[[5-Isopropyl-2-oxazolyl]methyl]thio]-2-thiazolyl]acetamide
Type:
Small organic molecule
Emp. Form.:
C12H15N3O2S2
Mol. Mass.:
297.396
SMILES:
CC(C)c1cnc(CSc2cnc(NC(C)=O)s2)o1
:
Substrate
Name:
GST-Rb fusion protein
Synonyms:
Glutathione S-transferase (GST)-retinoblastoma (Rb) fusion RB1 Rb | retinoblastoma
Type:
Other Protein Type
Mol. Mass.:
106410.17
Organism:
Homo sapiens (Human)
Description:
GST-60 kDa Rb fusion protein (comprising amino acids 378 to 928 of retinoblastoma)
Residue:
928