Target
Angiotensin-converting enzyme
Ligand
BDBM197052
Substrate
Meas. Tech.
Enzyme Assay
pH
7.4±n/a
IC50
49000±0 nM
Comments
extracted
Citation
 Simmons, WH 4-Fluoro-Thio-containing inhibitors of APP2, compositions thereof and method of use US Patent  US9212206 Publication Date 12/15/2015 
Target
Name:
Angiotensin-converting enzyme
Synonyms:
ACE Angiotensin converting enzyme (ACE) Angiotensin-converting enzyme, soluble form CD_antigen=CD143 DCP1 Kininase II
Type:
Enzyme
Mol. Mass.:
149709.01
Organism:
Homo sapiens (Human)
Description:
Residue:
1306
  
Inhibitor
Name:
BDBM197052
Synonyms:
US9212206, V
Type:
Small organic molecule
Emp. Form.:
C21H33N3O5S
Mol. Mass.:
439.569
SMILES:
CC(C)C[C@H](S)C(=O)N1CCC[C@H]1C(=O)N1CCC[C@H]1C(=O)N1CC[C@@H](C1)C(O)=O
: