Target
Prostaglandin E synthase
Ligand
BDBM197576
Substrate
Meas. Tech.
Inhibition Assay
IC50
0.3±n/a nM
Citation
 Otsu, H Heterocyclic derivative and pharmaceutical drug US Patent  US9216968 Publication Date 12/22/2015 
Target
Name:
Prostaglandin E synthase
Synonyms:
MGST1L1 PGES PTGES Prostaglandin E synthase (PGES-1) Prostaglandin E synthase-1 (PGES-1) Prostaglandin E2 synthase-1 ( mPGES-1)
Type:
Protein
Mol. Mass.:
17112.22
Organism:
Homo sapiens (Human)
Description:
Residue:
152
  
Inhibitor
Name:
BDBM197576
Synonyms:
US9216968, 176 | US9732066, 176
Type:
Small organic molecule
Emp. Form.:
C29H29ClF3N5O3
Mol. Mass.:
588.02
SMILES:
Cc1c(Cl)cccc1NC(=O)c1cc(NC(=O)c2ccccc2C(F)(F)F)cc2[nH]c(NCCOC(C)(C)C)nc12
: