Target
Macrophage colony-stimulating factor 1 receptor [555-568]
Ligand
BDBM198863
Substrate
Meas. Tech.
Fluorescence Polarization Competition Immunoassay
pH
7.5±n/a
IC50
3.2±n/a nM
Comments
extracted
Citation
 Illig, CRBallentine, SKChen, JDesjarlais, RLMeegalla, SKWall, MWilson, K Inhibitors of c-fms kinase US Patent  US9221797 Publication Date 12/29/2015 
Target
Name:
Macrophage colony-stimulating factor 1 receptor [555-568]
Synonyms:
CSF1R FMS FMS Substrate Peptide (aa 555-568) | Macrophage colony-stimulating factor 1 receptor (CSF1R) or (c-fms)
Type:
Peptide
Mol. Mass.:
1619.64
Organism:
Homo sapiens (Human)
Description:
P07333 aa 555-568
Residue:
14
SYEGNSYTFIDPTQ
  
Inhibitor
Name:
BDBM198863
Synonyms:
US9221797, 26
Type:
Small organic molecule
Emp. Form.:
C23H27N5O4S
Mol. Mass.:
469.557
SMILES:
O=C(Nc1ccc(CCS(=O)(=O)N2CCOCC2)cc1C1=CCCCC1)c1nc(c[nH]1)C#N
: