Target
Macrophage colony-stimulating factor 1 receptor [555-568]
Ligand
BDBM119043
Substrate
Meas. Tech.
Fluorescence Polarization Competition Immunoassay
pH
7.5±n/a
IC50
0.8±n/a nM
Comments
extracted
Citation
 Illig, CRBallentine, SKChen, JDesjarlais, RLMeegalla, SKWall, MWilson, K Inhibitors of c-fms kinase US Patent  US9221797 Publication Date 12/29/2015 
Target
Name:
Macrophage colony-stimulating factor 1 receptor [555-568]
Synonyms:
CSF1R FMS FMS Substrate Peptide (aa 555-568) | Macrophage colony-stimulating factor 1 receptor (CSF1R) or (c-fms)
Type:
Peptide
Mol. Mass.:
1619.64
Organism:
Homo sapiens (Human)
Description:
P07333 aa 555-568
Residue:
14
SYEGNSYTFIDPTQ
  
Inhibitor
Name:
BDBM119043
Synonyms:
CHEMBL3085978 US9221797, 60
Type:
Small organic molecule
Emp. Form.:
C25H31N5O2
Mol. Mass.:
433.5459
SMILES:
CC1(C)CCC(=CC1)c1cc(CCN2CCOCC2)ccc1NC(=O)c1ncc([nH]1)C#N
: