Target
Delta-type opioid receptor
Ligand
BDBM199346
Substrate
Meas. Tech.
Radioligand Dose-Displacement Binding Assay
pH
7.4±n/a
Temperature
298.15±n/a K
Ki
2.38±0.42 nM
Comments
extracted
Citation
 Kyle, DJTafesse, L Buprenorphine analogs US Patent  US9221831 Publication Date 12/29/2015 
Target
Name:
Delta-type opioid receptor
Synonyms:
D-OR-1 Delta opioid receptor OPIATE Delta OPRD1 OPRK1 | opioid receptor, delta 1
Type:
G Protein-Coupled Receptor (GPCR)
Mol. Mass.:
40382.98
Organism:
Homo sapiens (Human)
Description:
Competition binding assays were carried out using membrane preparations from transfected HN9.10 cells that constitutively expressed the delta opioid receptor.
Residue:
372
  
Inhibitor
Name:
BDBM199346
Synonyms:
US9221831, 11
Type:
Small organic molecule
Emp. Form.:
C33H37N3O4
Mol. Mass.:
539.6646
SMILES:
CO[C@]12CC[C@@]3(C[C@@H]1COc1ccc(cc1)-n1ccnc1)[C@H]1Cc4ccc(O)c5O[C@@H]2[C@]3(CCN1CC1CC1)c45
: