Target
ELAV-like protein 1 [I180A]
Ligand
BDBM94953
Substrate
IC50
41000±n/a nM
Citation
 PubChem, PC Identify HuR specific inhibitors PubChem Bioassay (2015)[AID] 
Target
Name:
ELAV-like protein 1 [I180A]
Synonyms:
ELAV1_HUMAN HUR | HuR RNA binding protein
Type:
Enzyme Catalytic Domain
Mol. Mass.:
36072.53
Organism:
Homo sapiens (Human)
Description:
gi_1022961
Residue:
326
  
Inhibitor
Name:
BDBM94953
Synonyms:
5-Amino-2-p-toluidinobenzenesulfonic acid 5-amino-2-(p-toluidino)besylic acid MLS000736579 cid_66672
Type:
Small organic molecule
Emp. Form.:
C13H14N2O3S
Mol. Mass.:
278.327
SMILES:
Cc1ccc(Nc2ccc(N)cc2S(O)(=O)=O)cc1
: