Target
6-phosphofructo-2-kinase/fructose-2,6-bisphosphatase 3
Ligand
BDBM200918
Substrate
Meas. Tech.
Kinase Assay (Method A)
IC50
450±n/a nM
Citation
 Bystrom, SHedgecock, CHoman, ELundback, TMartinsson, JSari, MFarnegardh, KJonsson, M Sulfonamide compounds US Patent  US9233946 Publication Date 1/12/2016 
Target
Name:
6-phosphofructo-2-kinase/fructose-2,6-bisphosphatase 3
Synonyms:
6-phosphofructo-2-kinase 6-phosphofructo-2-kinase/fructose-2,6-bisphosphatase 3 (PFKFB3) 6PF-2-K/Fru-2,6-P2ase brain/placenta-type isozyme Fructose-2,6-bisphosphatase PFKFB3 iPFK-2
Type:
Enzyme
Mol. Mass.:
59620.59
Organism:
Homo sapiens (Human)
Description:
Q16875
Residue:
520
  
Inhibitor
Name:
BDBM200918
Synonyms:
US9233946, 17
Type:
Small organic molecule
Emp. Form.:
C19H14FN5O2S
Mol. Mass.:
395.41
SMILES:
Fc1ccc(cc1)-c1cccc(c1)S(=O)(=O)Nc1cccc(c1)-c1nnn[nH]1
: