Target
Epidermal growth factor receptor [1-745,751-967]
Ligand
BDBM202371
Substrate
Meas. Tech.
Cell Based Assay
EC50
55±n/a nM
Citation
 Lee, KNiu, DPetter, RCSingh, J Heteroaryl compounds and uses thereof US Patent  US9238629 Publication Date 1/19/2016 
Target
Name:
Epidermal growth factor receptor [1-745,751-967]
Synonyms:
EGFR ERBB Epidermal growth factor receptor (EGFR) (delE746-A750) | HER1
Type:
Mol. Mass.:
106734.86
Organism:
Homo sapiens (Human)
Description:
P00533[1-745,751-967]
Residue:
962
  
Inhibitor
Name:
BDBM202371
Synonyms:
US10081606, Compound I-3 US9765038, Compound I-3
Type:
Small organic molecule
Emp. Form.:
C22H20F3N5O3
Mol. Mass.:
459.4211
SMILES:
COc1ccc(Nc2ncc(c(Nc3cccc(NC(=O)C=C)c3)n2)C(F)(F)F)c(OC)c1
: