Target
Epidermal growth factor receptor [1-745,751-967]
Ligand
BDBM202379
Substrate
Meas. Tech.
Cell Based Assay
EC50
300±n/a nM
Citation
 Lee, KNiu, DPetter, RCSingh, J Heteroaryl compounds and uses thereof US Patent  US9238629 Publication Date 1/19/2016 
Target
Name:
Epidermal growth factor receptor [1-745,751-967]
Synonyms:
EGFR ERBB Epidermal growth factor receptor (EGFR) (delE746-A750) | HER1
Type:
Mol. Mass.:
106734.86
Organism:
Homo sapiens (Human)
Description:
P00533[1-745,751-967]
Residue:
962
  
Inhibitor
Name:
BDBM202379
Synonyms:
US10081606, Compound I-11 US9765038, Compound I-11
Type:
Small organic molecule
Emp. Form.:
C23H22F3N5O4
Mol. Mass.:
489.4471
SMILES:
COc1ccc(Nc2ncc(c(Nc3cccc(NC(=O)C=C)c3)n2)C(F)(F)F)c(OC)c1OC
: